{"text_format":"1","workbook":"xlsx","n_sheets":5,"sheets":["Prod1","Prod2","Prod3","Summary","Aux"],"not_rendered":{"charts":0,"images":0,"macros":1,"external_links":0,"defined_names":4,"comments":0,"pivot_tables":1},"unopened":[],"bounds":{"document_bytes":16777216,"sheet_cells":100000,"rows_first":2000,"rows_last":500,"rows_between":2000,"halvings":0,"cell_chars":16384,"cell_head_chars":4096},"cells_cut":0,"cells_raw":0,"read":"whole","date_system":"1900"}

{"sheet":"Prod1","index":0,"n_rows":48,"n_cols":6,"rows_kept":48,"cut":false,"hidden":false,"merged":[]}
[]
[null,"Table1"]
[null,"Model","DDate","Cust","Qty","Amt"]
[null,{"$f":"INDEX(TableA[Mds_1],RANDBETWEEN(1,5))","v":"Sif"},{"$f":"DATE(RANDBETWEEN(2009,2010),RANDBETWEEN(1,12),RANDBETWEEN(1,31))","v":"2009-07-01"},{"$f":"INDEX(TableA[Mds_4],RANDBETWEEN(1,11))","v":"Smith"},{"$f":"RANDBETWEEN(1,10)","v":2},{"$f":"RANDBETWEEN(1000,9999)/100","v":91.77}]
[null,{"$f":"INDEX(TableA[Mds_1],RANDBETWEEN(1,5))","v":"Sif"},{"$f":"DATE(RANDBETWEEN(2009,2010),RANDBETWEEN(1,12),RANDBETWEEN(1,31))","v":"2010-04-17"},{"$f":"INDEX(TableA[Mds_4],RANDBETWEEN(1,11))","v":"Nelson"},{"$f":"RANDBETWEEN(1,10)","v":1},{"$f":"RANDBETWEEN(1000,9999)/100","v":64.25}]
[null,{"$f":"INDEX(TableA[Mds_1],RANDBETWEEN(1,5))","v":"Vus"},"2010-07-10",{"$f":"INDEX(TableA[Mds_4],RANDBETWEEN(1,11))","v":"Hill"},2,33.18]
[null,{"$f":"INDEX(TableA[Mds_1],RANDBETWEEN(1,5))","v":"Sif"},"2009-07-20",{"$f":"INDEX(TableA[Mds_4],RANDBETWEEN(1,11))","v":"Russell"},5,42.4]
[null,{"$f":"INDEX(TableA[Mds_1],RANDBETWEEN(1,5))","v":"Kuh"},"2010-10-03",{"$f":"INDEX(TableA[Mds_4],RANDBETWEEN(1,11))","v":"Russell"},9,66.31]
[null,{"$f":"INDEX(TableA[Mds_1],RANDBETWEEN(1,5))","v":"Nos"},"2009-11-05",{"$f":"INDEX(TableA[Mds_4],RANDBETWEEN(1,11))","v":"Porter"},4,17.53]
[null,{"$f":"INDEX(TableA[Mds_1],RANDBETWEEN(1,5))","v":"Sif"},"2010-06-17",{"$f":"INDEX(TableA[Mds_4],RANDBETWEEN(1,11))","v":"Russell"},3,53.89]
[null,{"$f":"INDEX(TableA[Mds_1],RANDBETWEEN(1,5))","v":"Nos"},"2010-01-23",{"$f":"INDEX(TableA[Mds_4],RANDBETWEEN(1,11))","v":"Crawford"},10,91.21]
[null,{"$f":"INDEX(TableA[Mds_1],RANDBETWEEN(1,5))","v":"Sib"},"2009-03-15",{"$f":"INDEX(TableA[Mds_4],RANDBETWEEN(1,11))","v":"Porter"},2,17.940000000000001]
[null,{"$f":"INDEX(TableA[Mds_1],RANDBETWEEN(1,5))","v":"Nos"},"2010-06-13",{"$f":"INDEX(TableA[Mds_4],RANDBETWEEN(1,11))","v":"Smith"},7,10.71]
[null,{"$f":"INDEX(TableA[Mds_1],RANDBETWEEN(1,5))","v":"Sif"},"2009-01-05",{"$f":"INDEX(TableA[Mds_4],RANDBETWEEN(1,11))","v":"Freeman"},9,13.07]
[null,{"$f":"INDEX(TableA[Mds_1],RANDBETWEEN(1,5))","v":"Nos"},"2009-06-11",{"$f":"INDEX(TableA[Mds_4],RANDBETWEEN(1,11))","v":"Carter"},1,32.81]
[null,{"$f":"INDEX(TableA[Mds_1],RANDBETWEEN(1,5))","v":"Kuh"},"2010-01-30",{"$f":"INDEX(TableA[Mds_4],RANDBETWEEN(1,11))","v":"Russell"},8,19.75]
[null,{"$f":"INDEX(TableA[Mds_1],RANDBETWEEN(1,5))","v":"Vus"},"2009-03-31",{"$f":"INDEX(TableA[Mds_4],RANDBETWEEN(1,11))","v":"Brooks"},1,17.23]
[null,{"$f":"INDEX(TableA[Mds_1],RANDBETWEEN(1,5))","v":"Nos"},"2010-04-11",{"$f":"INDEX(TableA[Mds_4],RANDBETWEEN(1,11))","v":"Nelson"},3,26.13]
[null,{"$f":"INDEX(TableA[Mds_1],RANDBETWEEN(1,5))","v":"Sif"},"2010-02-25",{"$f":"INDEX(TableA[Mds_4],RANDBETWEEN(1,11))","v":"Porter"},1,10.039999999999999]
[null,{"$f":"INDEX(TableA[Mds_1],RANDBETWEEN(1,5))","v":"Kuh"},"2010-08-22",{"$f":"INDEX(TableA[Mds_4],RANDBETWEEN(1,11))","v":"Jones"},5,14.9]
[null,{"$f":"INDEX(TableA[Mds_1],RANDBETWEEN(1,5))","v":"Vus"},"2010-09-22",{"$f":"INDEX(TableA[Mds_4],RANDBETWEEN(1,11))","v":"Hill"},10,52.92]
[null,{"$f":"INDEX(TableA[Mds_1],RANDBETWEEN(1,5))","v":"Vus"},"2010-09-30",{"$f":"INDEX(TableA[Mds_4],RANDBETWEEN(1,11))","v":"Crawford"},10,95.67]
[null,{"$f":"INDEX(TableA[Mds_1],RANDBETWEEN(1,5))","v":"Nos"},"2009-06-24",{"$f":"INDEX(TableA[Mds_4],RANDBETWEEN(1,11))","v":"Russell"},5,66.959999999999994]
[null,{"$f":"INDEX(TableA[Mds_1],RANDBETWEEN(1,5))","v":"Kuh"},"2009-09-12",{"$f":"INDEX(TableA[Mds_4],RANDBETWEEN(1,11))","v":"Freeman"},4,29.05]
[null,{"$f":"INDEX(TableA[Mds_1],RANDBETWEEN(1,5))","v":"Nos"},"2010-04-28",{"$f":"INDEX(TableA[Mds_4],RANDBETWEEN(1,11))","v":"Carter"},7,63.46]
[null,{"$f":"INDEX(TableA[Mds_1],RANDBETWEEN(1,5))","v":"Vus"},"2010-01-11",{"$f":"INDEX(TableA[Mds_4],RANDBETWEEN(1,11))","v":"Hunter"},3,84.94]
[null,{"$f":"INDEX(TableA[Mds_1],RANDBETWEEN(1,5))","v":"Nos"},"2010-09-04",{"$f":"INDEX(TableA[Mds_4],RANDBETWEEN(1,11))","v":"Smith"},9,70.89]
[null,{"$f":"INDEX(TableA[Mds_1],RANDBETWEEN(1,5))","v":"Vus"},"2009-06-12",{"$f":"INDEX(TableA[Mds_4],RANDBETWEEN(1,11))","v":"Carter"},8,44.45]
[null,{"$f":"INDEX(TableA[Mds_1],RANDBETWEEN(1,5))","v":"Nos"},"2010-02-22",{"$f":"INDEX(TableA[Mds_4],RANDBETWEEN(1,11))","v":"Nelson"},1,72.88]
[null,{"$f":"INDEX(TableA[Mds_1],RANDBETWEEN(1,5))","v":"Nos"},"2010-01-18",{"$f":"INDEX(TableA[Mds_4],RANDBETWEEN(1,11))","v":"Porter"},8,28.75]
[null,{"$f":"INDEX(TableA[Mds_1],RANDBETWEEN(1,5))","v":"Sib"},"2010-02-20",{"$f":"INDEX(TableA[Mds_4],RANDBETWEEN(1,11))","v":"Hill"},5,19.82]
[null,{"$f":"INDEX(TableA[Mds_1],RANDBETWEEN(1,5))","v":"Sib"},"2010-07-20",{"$f":"INDEX(TableA[Mds_4],RANDBETWEEN(1,11))","v":"Nelson"},2,88.44]
[null,{"$f":"INDEX(TableA[Mds_1],RANDBETWEEN(1,5))","v":"Sif"},"2009-03-02",{"$f":"INDEX(TableA[Mds_4],RANDBETWEEN(1,11))","v":"Smith"},1,82.02]
[null,{"$f":"INDEX(TableA[Mds_1],RANDBETWEEN(1,5))","v":"Vus"},"2010-10-09",{"$f":"INDEX(TableA[Mds_4],RANDBETWEEN(1,11))","v":"Porter"},6,41.48]
[null,{"$f":"INDEX(TableA[Mds_1],RANDBETWEEN(1,5))","v":"Kuh"},"2010-07-31",{"$f":"INDEX(TableA[Mds_4],RANDBETWEEN(1,11))","v":"Smith"},10,49.06]
[null,{"$f":"INDEX(TableA[Mds_1],RANDBETWEEN(1,5))","v":"Kuh"},"2009-05-01",{"$f":"INDEX(TableA[Mds_4],RANDBETWEEN(1,11))","v":"Nelson"},2,57.66]
[null,{"$f":"INDEX(TableA[Mds_1],RANDBETWEEN(1,5))","v":"Kuh"},"2009-02-02",{"$f":"INDEX(TableA[Mds_4],RANDBETWEEN(1,11))","v":"Smith"},8,96.5]
[null,{"$f":"INDEX(TableA[Mds_1],RANDBETWEEN(1,5))","v":"Kuh"},"2010-10-01",{"$f":"INDEX(TableA[Mds_4],RANDBETWEEN(1,11))","v":"Freeman"},5,45.17]
[null,{"$f":"INDEX(TableA[Mds_1],RANDBETWEEN(1,5))","v":"Nos"},"2010-03-11",{"$f":"INDEX(TableA[Mds_4],RANDBETWEEN(1,11))","v":"Crawford"},3,49.75]
[null,{"$f":"INDEX(TableA[Mds_1],RANDBETWEEN(1,5))","v":"Sif"},"2009-03-03",{"$f":"INDEX(TableA[Mds_4],RANDBETWEEN(1,11))","v":"Brooks"},3,16.25]
[null,{"$f":"INDEX(TableA[Mds_1],RANDBETWEEN(1,5))","v":"Sif"},"2009-02-18",{"$f":"INDEX(TableA[Mds_4],RANDBETWEEN(1,11))","v":"Hill"},9,61.58]
[null,{"$f":"INDEX(TableA[Mds_1],RANDBETWEEN(1,5))","v":"Sib"},"2010-07-03",{"$f":"INDEX(TableA[Mds_4],RANDBETWEEN(1,11))","v":"Porter"},7,96.68]
[null,{"$f":"INDEX(TableA[Mds_1],RANDBETWEEN(1,5))","v":"Nos"},"2010-04-26",{"$f":"INDEX(TableA[Mds_4],RANDBETWEEN(1,11))","v":"Crawford"},3,86.03]
[null,{"$f":"INDEX(TableA[Mds_1],RANDBETWEEN(1,5))","v":"Sif"},"2010-12-25",{"$f":"INDEX(TableA[Mds_4],RANDBETWEEN(1,11))","v":"Smith"},4,23.29]
[null,{"$f":"INDEX(TableA[Mds_1],RANDBETWEEN(1,5))","v":"Sif"},"2009-11-21",{"$f":"INDEX(TableA[Mds_4],RANDBETWEEN(1,11))","v":"Russell"},1,19.87]
[null,{"$f":"INDEX(TableA[Mds_1],RANDBETWEEN(1,5))","v":"Sif"},"2009-07-23",{"$f":"INDEX(TableA[Mds_4],RANDBETWEEN(1,11))","v":"Hill"},8,62.34]
[null,{"$f":"INDEX(TableA[Mds_1],RANDBETWEEN(1,5))","v":"Sib"},"2010-07-01",{"$f":"INDEX(TableA[Mds_4],RANDBETWEEN(1,11))","v":"Brooks"},4,44.78]
[null,{"$f":"INDEX(TableA[Mds_1],RANDBETWEEN(1,5))","v":"Kuh"},"2009-05-30",{"$f":"INDEX(TableA[Mds_4],RANDBETWEEN(1,11))","v":"Porter"},3,53.89]

{"sheet":"Prod2","index":1,"n_rows":44,"n_cols":6,"rows_kept":44,"cut":false,"hidden":false,"merged":[]}
[]
[null,"Table2"]
[null,"Model","DDate","Cust","Qty","Amt"]
[null,{"$f":"INDEX(TableA[Mds_2],RANDBETWEEN(1,5))","v":"Kuk"},{"$f":"DATE(RANDBETWEEN(2009,2010),RANDBETWEEN(1,12),RANDBETWEEN(1,31))","v":"2010-03-02"},{"$f":"INDEX(TableA[Mds_4],RANDBETWEEN(1,11))","v":"Nelson"},{"$f":"RANDBETWEEN(1,10)","v":9},{"$f":"RANDBETWEEN(1000,9999)/100","v":41.74}]
[null,{"$f":"INDEX(TableA[Mds_2],RANDBETWEEN(1,5))","v":"Tok"},{"$f":"DATE(RANDBETWEEN(2009,2010),RANDBETWEEN(1,12),RANDBETWEEN(1,31))","v":"2009-05-04"},{"$f":"INDEX(TableA[Mds_4],RANDBETWEEN(1,11))","v":"Crawford"},{"$f":"RANDBETWEEN(1,10)","v":6},{"$f":"RANDBETWEEN(1000,9999)/100","v":69.48}]
[null,{"$f":"INDEX(TableA[Mds_2],RANDBETWEEN(1,5))","v":"Mis"},"2010-07-01",{"$f":"INDEX(TableA[Mds_4],RANDBETWEEN(1,11))","v":"Hill"},6,45.37]
[null,{"$f":"INDEX(TableA[Mds_2],RANDBETWEEN(1,5))","v":"Kuk"},"2009-12-04",{"$f":"INDEX(TableA[Mds_4],RANDBETWEEN(1,11))","v":"Porter"},6,10.16]
[null,{"$f":"INDEX(TableA[Mds_2],RANDBETWEEN(1,5))","v":"Kuk"},"2009-03-14",{"$f":"INDEX(TableA[Mds_4],RANDBETWEEN(1,11))","v":"Porter"},3,36.450000000000003]
[null,{"$f":"INDEX(TableA[Mds_2],RANDBETWEEN(1,5))","v":"Mis"},"2009-07-01",{"$f":"INDEX(TableA[Mds_4],RANDBETWEEN(1,11))","v":"Jones"},1,89.28]
[null,{"$f":"INDEX(TableA[Mds_2],RANDBETWEEN(1,5))","v":"Kuk"},"2009-03-24",{"$f":"INDEX(TableA[Mds_4],RANDBETWEEN(1,11))","v":"Freeman"},1,15.55]
[null,{"$f":"INDEX(TableA[Mds_2],RANDBETWEEN(1,5))","v":"Tok"},"2009-04-28",{"$f":"INDEX(TableA[Mds_4],RANDBETWEEN(1,11))","v":"Smith"},4,64.87]
[null,{"$f":"INDEX(TableA[Mds_2],RANDBETWEEN(1,5))","v":"Tot"},"2010-03-15",{"$f":"INDEX(TableA[Mds_4],RANDBETWEEN(1,11))","v":"Porter"},3,12.06]
[null,{"$f":"INDEX(TableA[Mds_2],RANDBETWEEN(1,5))","v":"Tot"},"2010-06-23",{"$f":"INDEX(TableA[Mds_4],RANDBETWEEN(1,11))","v":"Porter"},4,57.35]
[null,{"$f":"INDEX(TableA[Mds_2],RANDBETWEEN(1,5))","v":"Tok"},"2009-12-19",{"$f":"INDEX(TableA[Mds_4],RANDBETWEEN(1,11))","v":"Smith"},10,24.33]
[null,{"$f":"INDEX(TableA[Mds_2],RANDBETWEEN(1,5))","v":"Tok"},"2009-11-07",{"$f":"INDEX(TableA[Mds_4],RANDBETWEEN(1,11))","v":"Russell"},2,97.14]
[null,{"$f":"INDEX(TableA[Mds_2],RANDBETWEEN(1,5))","v":"Mis"},"2010-12-13",{"$f":"INDEX(TableA[Mds_4],RANDBETWEEN(1,11))","v":"Crawford"},1,35.93]
[null,{"$f":"INDEX(TableA[Mds_2],RANDBETWEEN(1,5))","v":"Top"},"2010-12-09",{"$f":"INDEX(TableA[Mds_4],RANDBETWEEN(1,11))","v":"Brooks"},6,48.15]
[null,{"$f":"INDEX(TableA[Mds_2],RANDBETWEEN(1,5))","v":"Mis"},"2009-09-23",{"$f":"INDEX(TableA[Mds_4],RANDBETWEEN(1,11))","v":"Jones"},3,77.2]
[null,{"$f":"INDEX(TableA[Mds_2],RANDBETWEEN(1,5))","v":"Mis"},"2010-03-06",{"$f":"INDEX(TableA[Mds_4],RANDBETWEEN(1,11))","v":"Nelson"},8,46.25]
[null,{"$f":"INDEX(TableA[Mds_2],RANDBETWEEN(1,5))","v":"Kuk"},"2009-06-04",{"$f":"INDEX(TableA[Mds_4],RANDBETWEEN(1,11))","v":"Hunter"},1,24.51]
[null,{"$f":"INDEX(TableA[Mds_2],RANDBETWEEN(1,5))","v":"Tot"},"2009-12-12",{"$f":"INDEX(TableA[Mds_4],RANDBETWEEN(1,11))","v":"Smith"},1,61.32]
[null,{"$f":"INDEX(TableA[Mds_2],RANDBETWEEN(1,5))","v":"Kuk"},"2009-12-22",{"$f":"INDEX(TableA[Mds_4],RANDBETWEEN(1,11))","v":"Porter"},10,16.23]
[null,{"$f":"INDEX(TableA[Mds_2],RANDBETWEEN(1,5))","v":"Tok"},"2010-08-19",{"$f":"INDEX(TableA[Mds_4],RANDBETWEEN(1,11))","v":"Freeman"},2,89.1]
[null,{"$f":"INDEX(TableA[Mds_2],RANDBETWEEN(1,5))","v":"Mis"},"2009-05-21",{"$f":"INDEX(TableA[Mds_4],RANDBETWEEN(1,11))","v":"Hill"},6,79.64]
[null,{"$f":"INDEX(TableA[Mds_2],RANDBETWEEN(1,5))","v":"Tok"},"2009-07-11",{"$f":"INDEX(TableA[Mds_4],RANDBETWEEN(1,11))","v":"Hunter"},6,66.11]
[null,{"$f":"INDEX(TableA[Mds_2],RANDBETWEEN(1,5))","v":"Tok"},"2010-12-03",{"$f":"INDEX(TableA[Mds_4],RANDBETWEEN(1,11))","v":"Porter"},7,45.07]
[null,{"$f":"INDEX(TableA[Mds_2],RANDBETWEEN(1,5))","v":"Mis"},"2010-04-20",{"$f":"INDEX(TableA[Mds_4],RANDBETWEEN(1,11))","v":"Jones"},1,50.28]
[null,{"$f":"INDEX(TableA[Mds_2],RANDBETWEEN(1,5))","v":"Mis"},"2009-08-01",{"$f":"INDEX(TableA[Mds_4],RANDBETWEEN(1,11))","v":"Nelson"},7,73.680000000000007]
[null,{"$f":"INDEX(TableA[Mds_2],RANDBETWEEN(1,5))","v":"Tot"},"2009-11-13",{"$f":"INDEX(TableA[Mds_4],RANDBETWEEN(1,11))","v":"Freeman"},6,75.31]
[null,{"$f":"INDEX(TableA[Mds_2],RANDBETWEEN(1,5))","v":"Kuk"},"2010-10-23",{"$f":"INDEX(TableA[Mds_4],RANDBETWEEN(1,11))","v":"Smith"},1,92.17]
[null,{"$f":"INDEX(TableA[Mds_2],RANDBETWEEN(1,5))","v":"Top"},"2009-02-28",{"$f":"INDEX(TableA[Mds_4],RANDBETWEEN(1,11))","v":"Nelson"},9,11.97]
[null,{"$f":"INDEX(TableA[Mds_2],RANDBETWEEN(1,5))","v":"Mis"},"2009-04-30",{"$f":"INDEX(TableA[Mds_4],RANDBETWEEN(1,11))","v":"Freeman"},6,20.5]
[null,{"$f":"INDEX(TableA[Mds_2],RANDBETWEEN(1,5))","v":"Tok"},"2009-01-23",{"$f":"INDEX(TableA[Mds_4],RANDBETWEEN(1,11))","v":"Russell"},2,72.069999999999993]
[null,{"$f":"INDEX(TableA[Mds_2],RANDBETWEEN(1,5))","v":"Top"},"2009-11-23",{"$f":"INDEX(TableA[Mds_4],RANDBETWEEN(1,11))","v":"Smith"},4,83.55]
[null,{"$f":"INDEX(TableA[Mds_2],RANDBETWEEN(1,5))","v":"Tok"},"2010-07-08",{"$f":"INDEX(TableA[Mds_4],RANDBETWEEN(1,11))","v":"Hunter"},4,29.65]
[null,{"$f":"INDEX(TableA[Mds_2],RANDBETWEEN(1,5))","v":"Top"},"2010-08-18",{"$f":"INDEX(TableA[Mds_4],RANDBETWEEN(1,11))","v":"Hunter"},4,41.67]
[null,{"$f":"INDEX(TableA[Mds_2],RANDBETWEEN(1,5))","v":"Kuk"},"2009-05-18",{"$f":"INDEX(TableA[Mds_4],RANDBETWEEN(1,11))","v":"Nelson"},8,46.27]
[null,{"$f":"INDEX(TableA[Mds_2],RANDBETWEEN(1,5))","v":"Tot"},"2009-11-03",{"$f":"INDEX(TableA[Mds_4],RANDBETWEEN(1,11))","v":"Brooks"},9,49.49]
[null,{"$f":"INDEX(TableA[Mds_2],RANDBETWEEN(1,5))","v":"Mis"},"2010-10-24",{"$f":"INDEX(TableA[Mds_4],RANDBETWEEN(1,11))","v":"Brooks"},2,33.450000000000003]
[null,{"$f":"INDEX(TableA[Mds_2],RANDBETWEEN(1,5))","v":"Kuk"},"2010-07-16",{"$f":"INDEX(TableA[Mds_4],RANDBETWEEN(1,11))","v":"Smith"},8,38.58]
[null,{"$f":"INDEX(TableA[Mds_2],RANDBETWEEN(1,5))","v":"Top"},"2009-10-25",{"$f":"INDEX(TableA[Mds_4],RANDBETWEEN(1,11))","v":"Hunter"},3,15.54]
[null,{"$f":"INDEX(TableA[Mds_2],RANDBETWEEN(1,5))","v":"Top"},"2010-11-30",{"$f":"INDEX(TableA[Mds_4],RANDBETWEEN(1,11))","v":"Crawford"},9,28.18]
[null,{"$f":"INDEX(TableA[Mds_2],RANDBETWEEN(1,5))","v":"Tok"},"2010-12-13",{"$f":"INDEX(TableA[Mds_4],RANDBETWEEN(1,11))","v":"Hunter"},7,85.31]
[null,{"$f":"INDEX(TableA[Mds_2],RANDBETWEEN(1,5))","v":"Mis"},"2010-12-09",{"$f":"INDEX(TableA[Mds_4],RANDBETWEEN(1,11))","v":"Porter"},3,11.76]

{"sheet":"Prod3","index":2,"n_rows":39,"n_cols":6,"rows_kept":39,"cut":false,"hidden":false,"merged":[]}
[]
[null,"Table3"]
[null,"Model","DDate","Cust","Qty","Amt"]
[null,{"$f":"INDEX(TableA[Mds_3],RANDBETWEEN(1,5))","v":"Jom"},{"$f":"DATE(RANDBETWEEN(2009,2010),RANDBETWEEN(1,12),RANDBETWEEN(1,31))","v":"2010-02-26"},{"$f":"INDEX(TableA[Mds_4],RANDBETWEEN(1,11))","v":"Carter"},{"$f":"RANDBETWEEN(1,10)","v":5},{"$f":"RANDBETWEEN(1000,9999)/100","v":21.97}]
[null,{"$f":"INDEX(TableA[Mds_3],RANDBETWEEN(1,5))","v":"Wok"},{"$f":"DATE(RANDBETWEEN(2009,2010),RANDBETWEEN(1,12),RANDBETWEEN(1,31))","v":"2009-05-18"},{"$f":"INDEX(TableA[Mds_4],RANDBETWEEN(1,11))","v":"Hill"},{"$f":"RANDBETWEEN(1,10)","v":5},{"$f":"RANDBETWEEN(1000,9999)/100","v":97.56}]
[null,{"$f":"INDEX(TableA[Mds_3],RANDBETWEEN(1,5))","v":"Hop"},"2009-10-06",{"$f":"INDEX(TableA[Mds_4],RANDBETWEEN(1,11))","v":"Russell"},10,10.029999999999999]
[null,{"$f":"INDEX(TableA[Mds_3],RANDBETWEEN(1,5))","v":"Tik"},"2010-09-20",{"$f":"INDEX(TableA[Mds_4],RANDBETWEEN(1,11))","v":"Porter"},8,93.55]
[null,{"$f":"INDEX(TableA[Mds_3],RANDBETWEEN(1,5))","v":"Wok"},"2010-05-14",{"$f":"INDEX(TableA[Mds_4],RANDBETWEEN(1,11))","v":"Porter"},7,58.54]
[null,{"$f":"INDEX(TableA[Mds_3],RANDBETWEEN(1,5))","v":"Lip"},"2010-03-08",{"$f":"INDEX(TableA[Mds_4],RANDBETWEEN(1,11))","v":"Brooks"},3,82.63]
[null,{"$f":"INDEX(TableA[Mds_3],RANDBETWEEN(1,5))","v":"Hop"},"2009-09-09",{"$f":"INDEX(TableA[Mds_4],RANDBETWEEN(1,11))","v":"Porter"},9,44.81]
[null,{"$f":"INDEX(TableA[Mds_3],RANDBETWEEN(1,5))","v":"Lip"},"2010-12-23",{"$f":"INDEX(TableA[Mds_4],RANDBETWEEN(1,11))","v":"Brooks"},1,11.27]
[null,{"$f":"INDEX(TableA[Mds_3],RANDBETWEEN(1,5))","v":"Tik"},"2010-08-30",{"$f":"INDEX(TableA[Mds_4],RANDBETWEEN(1,11))","v":"Smith"},7,52.36]
[null,{"$f":"INDEX(TableA[Mds_3],RANDBETWEEN(1,5))","v":"Hop"},"2010-03-05",{"$f":"INDEX(TableA[Mds_4],RANDBETWEEN(1,11))","v":"Freeman"},3,98.29]
[null,{"$f":"INDEX(TableA[Mds_3],RANDBETWEEN(1,5))","v":"Jom"},"2009-10-01",{"$f":"INDEX(TableA[Mds_4],RANDBETWEEN(1,11))","v":"Nelson"},3,63.93]
[null,{"$f":"INDEX(TableA[Mds_3],RANDBETWEEN(1,5))","v":"Hop"},"2010-04-09",{"$f":"INDEX(TableA[Mds_4],RANDBETWEEN(1,11))","v":"Jones"},5,45.28]
[null,{"$f":"INDEX(TableA[Mds_3],RANDBETWEEN(1,5))","v":"Tik"},"2009-11-07",{"$f":"INDEX(TableA[Mds_4],RANDBETWEEN(1,11))","v":"Nelson"},10,33.340000000000003]
[null,{"$f":"INDEX(TableA[Mds_3],RANDBETWEEN(1,5))","v":"Lip"},"2010-01-29",{"$f":"INDEX(TableA[Mds_4],RANDBETWEEN(1,11))","v":"Russell"},4,34.19]
[null,{"$f":"INDEX(TableA[Mds_3],RANDBETWEEN(1,5))","v":"Hop"},"2009-07-18",{"$f":"INDEX(TableA[Mds_4],RANDBETWEEN(1,11))","v":"Carter"},7,25.9]
[null,{"$f":"INDEX(TableA[Mds_3],RANDBETWEEN(1,5))","v":"Jom"},"2009-10-27",{"$f":"INDEX(TableA[Mds_4],RANDBETWEEN(1,11))","v":"Crawford"},2,75.13]
[null,{"$f":"INDEX(TableA[Mds_3],RANDBETWEEN(1,5))","v":"Wok"},"2009-08-23",{"$f":"INDEX(TableA[Mds_4],RANDBETWEEN(1,11))","v":"Hill"},8,58.88]
[null,{"$f":"INDEX(TableA[Mds_3],RANDBETWEEN(1,5))","v":"Hop"},"2009-04-05",{"$f":"INDEX(TableA[Mds_4],RANDBETWEEN(1,11))","v":"Russell"},5,44.59]
[null,{"$f":"INDEX(TableA[Mds_3],RANDBETWEEN(1,5))","v":"Wok"},"2009-01-29",{"$f":"INDEX(TableA[Mds_4],RANDBETWEEN(1,11))","v":"Freeman"},6,68.47]
[null,{"$f":"INDEX(TableA[Mds_3],RANDBETWEEN(1,5))","v":"Wok"},"2009-02-09",{"$f":"INDEX(TableA[Mds_4],RANDBETWEEN(1,11))","v":"Crawford"},3,26.49]
[null,{"$f":"INDEX(TableA[Mds_3],RANDBETWEEN(1,5))","v":"Tik"},"2010-10-05",{"$f":"INDEX(TableA[Mds_4],RANDBETWEEN(1,11))","v":"Brooks"},10,25.49]
[null,{"$f":"INDEX(TableA[Mds_3],RANDBETWEEN(1,5))","v":"Lip"},"2009-02-17",{"$f":"INDEX(TableA[Mds_4],RANDBETWEEN(1,11))","v":"Smith"},9,17.73]
[null,{"$f":"INDEX(TableA[Mds_3],RANDBETWEEN(1,5))","v":"Jom"},"2010-05-18",{"$f":"INDEX(TableA[Mds_4],RANDBETWEEN(1,11))","v":"Hill"},1,97.23]
[null,{"$f":"INDEX(TableA[Mds_3],RANDBETWEEN(1,5))","v":"Jom"},"2010-03-29",{"$f":"INDEX(TableA[Mds_4],RANDBETWEEN(1,11))","v":"Russell"},5,29.98]
[null,{"$f":"INDEX(TableA[Mds_3],RANDBETWEEN(1,5))","v":"Hop"},"2010-12-01",{"$f":"INDEX(TableA[Mds_4],RANDBETWEEN(1,11))","v":"Nelson"},8,79.28]
[null,{"$f":"INDEX(TableA[Mds_3],RANDBETWEEN(1,5))","v":"Lip"},"2010-04-28",{"$f":"INDEX(TableA[Mds_4],RANDBETWEEN(1,11))","v":"Brooks"},4,56.8]
[null,{"$f":"INDEX(TableA[Mds_3],RANDBETWEEN(1,5))","v":"Jom"},"2009-12-04",{"$f":"INDEX(TableA[Mds_4],RANDBETWEEN(1,11))","v":"Freeman"},10,57.44]
[null,{"$f":"INDEX(TableA[Mds_3],RANDBETWEEN(1,5))","v":"Wok"},"2009-01-20",{"$f":"INDEX(TableA[Mds_4],RANDBETWEEN(1,11))","v":"Hunter"},2,85.08]
[null,{"$f":"INDEX(TableA[Mds_3],RANDBETWEEN(1,5))","v":"Jom"},"2009-02-04",{"$f":"INDEX(TableA[Mds_4],RANDBETWEEN(1,11))","v":"Nelson"},5,44.01]
[null,{"$f":"INDEX(TableA[Mds_3],RANDBETWEEN(1,5))","v":"Tik"},"2010-05-19",{"$f":"INDEX(TableA[Mds_4],RANDBETWEEN(1,11))","v":"Hill"},7,17.11]
[null,{"$f":"INDEX(TableA[Mds_3],RANDBETWEEN(1,5))","v":"Wok"},"2009-12-04",{"$f":"INDEX(TableA[Mds_4],RANDBETWEEN(1,11))","v":"Carter"},1,77.88]
[null,{"$f":"INDEX(TableA[Mds_3],RANDBETWEEN(1,5))","v":"Hop"},"2009-07-21",{"$f":"INDEX(TableA[Mds_4],RANDBETWEEN(1,11))","v":"Freeman"},8,87.14]
[null,{"$f":"INDEX(TableA[Mds_3],RANDBETWEEN(1,5))","v":"Lip"},"2010-08-16",{"$f":"INDEX(TableA[Mds_4],RANDBETWEEN(1,11))","v":"Carter"},5,66.489999999999995]
[null,{"$f":"INDEX(TableA[Mds_3],RANDBETWEEN(1,5))","v":"Tik"},"2009-11-11",{"$f":"INDEX(TableA[Mds_4],RANDBETWEEN(1,11))","v":"Russell"},4,73.5]
[null,{"$f":"INDEX(TableA[Mds_3],RANDBETWEEN(1,5))","v":"Hop"},"2009-10-21",{"$f":"INDEX(TableA[Mds_4],RANDBETWEEN(1,11))","v":"Nelson"},10,22.21]
[null,{"$f":"INDEX(TableA[Mds_3],RANDBETWEEN(1,5))","v":"Wok"},"2009-08-07",{"$f":"INDEX(TableA[Mds_4],RANDBETWEEN(1,11))","v":"Russell"},4,78.540000000000006]

{"sheet":"Summary","index":3,"n_rows":100,"n_cols":12,"rows_kept":100,"cut":false,"hidden":false,"merged":[]}
[]
[null,"PivotTable"]
[null,null,null,null,"Years","DDate","Values"]
[null,null,null,null,"2010"]
[null,null,null,null,"Qtr1",null,"Qtr2",null,"Qtr3",null,"Qtr4"]
[null,"Cust","Prod","Model","_Qty","_Amt","_Qty","_Amt","_Qty","_Amt","_Qty","_Amt"]
[null,"Brooks",null,null,null,null,1,71.13,3,11.02,14,78.25]
[null,null,"Prod1",null,null,null,null,null,3,11.02,7,15.53]
[null,null,null,"Kuh",null,null,null,null,3,11.02]
[null,null,null,"Vus",null,null,null,null,null,null,7,15.53]
[null,null,"Prod2",null,null,null,1,71.13,null,null,7,62.72]
[null,null,null,"Top",null,null,1,71.13]
[null,null,null,"Tot",null,null,null,null,null,null,7,62.72]
[null,"Carter",null,null,6,93.04,15,183.72,8,102.91999999999999]
[null,null,"Prod1",null,6,93.04,3,32.299999999999997]
[null,null,null,"Kuh",null,null,3,32.299999999999997]
[null,null,null,"Vus",6,93.04]
[null,null,"Prod2",null,null,null,6,87.65,8,102.91999999999999]
[null,null,null,"Kuk",null,null,6,87.65,2,30.6]
[null,null,null,"Top",null,null,null,null,6,72.319999999999993]
[null,null,"Prod3",null,null,null,6,63.77]
[null,null,null,"Lip",null,null,6,63.77]
[null,"Crawford",null,null,5,58.67,7,29.19,null,null,21,192.32]
[null,null,"Prod1",null,5,58.67,null,null,null,null,10,22.06]
[null,null,null,"Nos",5,58.67]
[null,null,null,"Vus",null,null,null,null,null,null,10,22.06]
[null,null,"Prod2",null,null,null,null,null,null,null,11,170.26]
[null,null,null,"Tok",null,null,null,null,null,null,10,78.13]
[null,null,null,"Top",null,null,null,null,null,null,1,92.13]
[null,null,"Prod3",null,null,null,7,29.19]
[null,null,null,"Lip",null,null,7,29.19]
[null,"Freeman",null,null,10,53.48,12,138.84,10,109.91999999999999]
[null,null,"Prod1",null,null,null,3,54.2,3,95.85]
[null,null,null,"Nos",null,null,null,null,3,95.85]
[null,null,null,"Vus",null,null,3,54.2]
[null,null,"Prod2",null,10,53.48]
[null,null,null,"Tot",10,53.48]
[null,null,"Prod3",null,null,null,9,84.64,7,14.07]
[null,null,null,"Hop",null,null,null,null,7,14.07]
[null,null,null,"Lip",null,null,9,84.64]
[null,"Hill",null,null,6,45.89,18,112.4]
[null,null,"Prod1",null,6,45.89,9,84.39]
[null,null,null,"Kuh",6,45.89]
[null,null,null,"Vus",null,null,9,84.39]
[null,null,"Prod2",null,null,null,9,28.01]
[null,null,null,"Mis",null,null,9,28.01]
[null,"Hunter",null,null,9,81.739999999999995,null,null,10,110.37,10,52.63]
[null,null,"Prod1",null,null,null,null,null,null,null,10,52.63]
[null,null,null,"Kuh",null,null,null,null,null,null,10,52.63]
[null,null,"Prod2",null,null,null,null,null,7,71.7]
[null,null,null,"Mis",null,null,null,null,7,71.7]
[null,null,"Prod3",null,9,81.739999999999995,null,null,3,38.67]
[null,null,null,"Tik",9,81.739999999999995]
[null,null,null,"Wok",null,null,null,null,3,38.67]
[null,"Jones",null,null,1,38.72,null,null,10,89.86]
[null,null,"Prod1",null,1,38.72]
[null,null,null,"Kuh",1,38.72]
[null,null,"Prod2",null,null,null,null,null,2,37.71]
[null,null,null,"Kuk",null,null,null,null,2,37.71]
[null,null,"Prod3",null,null,null,null,null,8,52.15]
[null,null,null,"Lip",null,null,null,null,8,52.15]
[null,"Nelson",null,null,8,50.77,18,129.54999999999998,5,63.29]
[null,null,"Prod2",null,8,50.77,18,129.54999999999998]
[null,null,null,"Kuk",null,null,8,115.57999999999998]
[null,null,null,"Mis",8,50.77]
[null,null,null,"Top",null,null,10,13.97]
[null,null,"Prod3",null,null,null,null,null,5,63.29]
[null,null,null,"Jom",null,null,null,null,5,63.29]
[null,"Porter",null,null,null,null,14,153.63,2,80.319999999999993,15,112.64]
[null,null,"Prod1",null,null,null,8,123.69,2,80.319999999999993,9,68.84]
[null,null,null,"Nos",null,null,null,null,null,null,9,68.84]
[null,null,null,"Sif",null,null,6,82.39]
[null,null,null,"Vus",null,null,2,41.3,2,80.319999999999993]
[null,null,"Prod3",null,null,null,6,29.94,null,null,6,43.8]
[null,null,null,"Tik",null,null,null,null,null,null,6,43.8]
[null,null,null,"Wok",null,null,6,29.94]
[null,"Russell",null,null,4,98.28,17,264.36,12,92.06,11,112.36]
[null,null,"Prod1",null,4,98.28,4,90,12,92.06]
[null,null,null,"Kuh",4,98.28,1,27.61]
[null,null,null,"Nos",null,null,null,null,6,79.06]
[null,null,null,"Sif",null,null,null,null,6,13]
[null,null,null,"Vus",null,null,3,62.39]
[null,null,"Prod2",null,null,null,null,null,null,null,11,112.36]
[null,null,null,"Kuk",null,null,null,null,null,null,7,75.53]
[null,null,null,"Top",null,null,null,null,null,null,4,36.83]
[null,null,"Prod3",null,null,null,13,174.36]
[null,null,null,"Hop",null,null,3,76.19]
[null,null,null,"Lip",null,null,1,49.47]
[null,null,null,"Tik",null,null,9,48.7]
[null,"Smith",null,null,21,146.02000000000001,4,130.49,null,null,17,130.66]
[null,null,"Prod1",null,12,94.77000000000001,null,null,null,null,11,74.56]
[null,null,null,"Nos",10,43.95]
[null,null,null,"Sib",null,null,null,null,null,null,7,63.44]
[null,null,null,"Vus",2,50.82,null,null,null,null,4,11.12]
[null,null,"Prod2",null,9,51.25,null,null,null,null,6,56.1]
[null,null,null,"Mis",null,null,null,null,null,null,6,56.1]
[null,null,null,"Tot",9,51.25]
[null,null,"Prod3",null,null,null,4,130.49]
[null,null,null,"Lip",null,null,2,87.38]
[null,null,null,"Tik",null,null,2,43.11]

{"sheet":"Aux","index":4,"n_rows":125,"n_cols":13,"rows_kept":125,"cut":false,"hidden":false,"merged":[]}
[]
[null,"Table4",null,null,null,null,null,null,null,"Random data for test"]
[null,"Model","DDate","Cust","Qty","Amt","Prod",null,null,"Mds_1","Mds_2","Mds_3","Mds_4"]
[null,"Vus","2010-01-18","Smith",2,50.82,"Prod1",null,null,"Kuh","Kuk","Hop","Crawford"]
[null,"Nos","2010-09-03","Freeman",3,95.85,"Prod1",null,null,"Sif","Mis","Wok","Russell"]
[null,"Kuh","2010-06-09","Russell",1,27.61,"Prod1",null,null,"Nos","Top","Tik","Freeman"]
[null,"Sif","2009-11-21","Jones",8,72.8,"Prod1",null,null,"Sib","Tok","Lip","Porter"]
[null,"Kuh","2009-12-13","Freeman",3,74.41,"Prod1",null,null,"Vus","Tot","Jom","Nelson"]
[null,"Nos","2009-08-31","Hunter",10,70.819999999999993,"Prod1",null,null,null,null,null,"Brooks"]
[null,"Kuh","2010-09-21","Brooks",3,11.02,"Prod1",null,null,null,null,null,"Carter"]
[null,"Sif","2009-02-17","Jones",4,44.41,"Prod1",null,null,null,null,null,"Smith"]
[null,"Sif","2009-10-25","Hill",10,65.94,"Prod1",null,null,null,null,null,"Hill"]
[null,"Vus","2010-12-12","Smith",4,11.12,"Prod1",null,null,null,null,null,"Hunter"]
[null,"Nos","2009-07-09","Smith",8,60.66,"Prod1",null,null,null,null,null,"Jones"]
[null,"Sif","2010-09-14","Russell",6,13,"Prod1"]
[null,"Nos","2009-05-21","Jones",1,28.8,"Prod1"]
[null,"Kuh","2010-02-11","Hill",6,45.89,"Prod1"]
[null,"Kuh","2009-09-12","Carter",4,85.94,"Prod1"]
[null,"Nos","2010-11-25","Porter",9,68.84,"Prod1"]
[null,"Kuh","2010-02-20","Russell",4,98.28,"Prod1"]
[null,"Nos","2010-02-10","Crawford",5,58.67,"Prod1"]
[null,"Kuh","2009-02-21","Carter",7,58.33,"Prod1"]
[null,"Sif","2009-04-12","Porter",4,32.67,"Prod1"]
[null,"Vus","2010-08-02","Porter",2,80.319999999999993,"Prod1"]
[null,"Kuh","2009-09-18","Hunter",6,29.16,"Prod1"]
[null,"Sif","2009-11-13","Nelson",8,98.1,"Prod1"]
[null,"Sib","2010-10-14","Smith",7,63.44,"Prod1"]
[null,"Kuh","2009-11-25","Smith",8,37.72,"Prod1"]
[null,"Sib","2009-11-08","Crawford",8,77.87,"Prod1"]
[null,"Vus","2010-05-15","Hill",9,84.39,"Prod1"]
[null,"Vus","2010-03-01","Carter",6,93.04,"Prod1"]
[null,"Nos","2010-01-18","Smith",10,43.95,"Prod1"]
[null,"Kuh","2010-06-06","Carter",3,32.299999999999997,"Prod1"]
[null,"Kuh","2010-11-14","Hunter",10,52.63,"Prod1"]
[null,"Kuh","2010-01-23","Jones",1,38.72,"Prod1"]
[null,"Vus","2010-04-20","Porter",2,41.3,"Prod1"]
[null,"Vus","2010-11-08","Brooks",7,15.53,"Prod1"]
[null,"Nos","2010-08-28","Russell",6,79.06,"Prod1"]
[null,"Sib","2009-05-06","Smith",4,51.98,"Prod1"]
[null,"Sib","2009-08-28","Smith",10,53.79,"Prod1"]
[null,"Nos","2009-08-28","Crawford",4,96.15,"Prod1"]
[null,"Vus","2010-04-06","Russell",3,62.39,"Prod1"]
[null,"Sif","2010-04-19","Porter",6,82.39,"Prod1"]
[null,"Sif","2009-11-06","Smith",6,76.28,"Prod1"]
[null,"Vus","2010-12-27","Crawford",10,22.06,"Prod1"]
[null,"Vus","2009-11-24","Russell",8,67.599999999999994,"Prod1"]
[null,"Vus","2009-02-11","Smith",6,78.45,"Prod1"]
[null,"Vus","2010-04-11","Freeman",3,54.2,"Prod1"]
[null,"Kuk","2009-12-06","Russell",1,44.71,"Prod2"]
[null,"Tot","2010-03-04","Smith",9,51.25,"Prod2"]
[null,"Mis","2009-07-15","Carter",1,33.119999999999997,"Prod2"]
[null,"Top","2009-01-30","Jones",3,72.17,"Prod2"]
[null,"Top","2010-10-01","Crawford",1,92.13,"Prod2"]
[null,"Tot","2009-03-01","Nelson",2,87.18,"Prod2"]
[null,"Tok","2009-08-24","Brooks",9,92.64,"Prod2"]
[null,"Mis","2010-10-06","Smith",6,56.1,"Prod2"]
[null,"Mis","2010-01-06","Nelson",8,50.77,"Prod2"]
[null,"Kuk","2010-11-05","Russell",7,75.53,"Prod2"]
[null,"Tok","2010-11-11","Crawford",10,78.13,"Prod2"]
[null,"Top","2010-10-09","Russell",4,36.83,"Prod2"]
[null,"Top","2009-08-03","Nelson",8,65.55,"Prod2"]
[null,"Tok","2009-11-26","Russell",5,87.98,"Prod2"]
[null,"Tot","2009-11-29","Brooks",6,67.150000000000006,"Prod2"]
[null,"Mis","2009-12-18","Nelson",8,95.61,"Prod2"]
[null,"Kuk","2010-05-25","Carter",6,87.65,"Prod2"]
[null,"Kuk","2010-04-11","Nelson",5,70.459999999999994,"Prod2"]
[null,"Tot","2009-09-21","Brooks",8,45.27,"Prod2"]
[null,"Top","2010-04-11","Brooks",1,71.13,"Prod2"]
[null,"Top","2009-03-26","Smith",5,54.9,"Prod2"]
[null,"Mis","2009-12-09","Porter",10,79.25,"Prod2"]
[null,"Tot","2010-11-04","Brooks",7,62.72,"Prod2"]
[null,"Tot","2010-03-25","Freeman",10,53.48,"Prod2"]
[null,"Mis","2010-04-03","Hill",9,28.01,"Prod2"]
[null,"Tot","2009-10-28","Jones",1,87.43,"Prod2"]
[null,"Mis","2009-10-13","Carter",7,20.77,"Prod2"]
[null,"Top","2010-05-19","Nelson",10,13.97,"Prod2"]
[null,"Mis","2009-05-13","Smith",10,15.36,"Prod2"]
[null,"Kuk","2010-07-25","Jones",2,37.71,"Prod2"]
[null,"Mis","2009-07-01","Carter",10,37.24,"Prod2"]
[null,"Kuk","2010-06-03","Nelson",3,45.12,"Prod2"]
[null,"Top","2010-08-17","Carter",6,72.319999999999993,"Prod2"]
[null,"Kuk","2010-08-24","Carter",2,30.6,"Prod2"]
[null,"Mis","2010-08-13","Hunter",7,71.7,"Prod2"]
[null,"Top","2009-06-03","Brooks",7,85.66,"Prod2"]
[null,"Mis","2009-04-11","Crawford",8,67.05,"Prod2"]
[null,"Mis","2009-04-18","Porter",3,39.07,"Prod2"]
[null,"Mis","2009-02-24","Freeman",1,74.099999999999994,"Prod2"]
[null,"Tok","2009-06-07","Nelson",3,81.790000000000006,"Prod2"]
[null,"Top","2009-11-11","Porter",4,22.81,"Prod2"]
[null,"Hop","2010-06-22","Russell",3,76.19,"Prod3"]
[null,"Hop","2009-04-17","Hill",6,80.22,"Prod3"]
[null,"Lip","2010-05-09","Russell",1,49.47,"Prod3"]
[null,"Jom","2009-02-26","Smith",2,21.73,"Prod3"]
[null,"Lip","2009-06-12","Carter",5,88.95,"Prod3"]
[null,"Jom","2009-11-23","Smith",5,43.73,"Prod3"]
[null,"Jom","2009-02-21","Porter",6,48.98,"Prod3"]
[null,"Tik","2010-10-19","Porter",6,43.8,"Prod3"]
[null,"Hop","2009-05-03","Porter",3,54.16,"Prod3"]
[null,"Wok","2009-03-29","Smith",9,15.98,"Prod3"]
[null,"Lip","2010-09-15","Jones",8,52.15,"Prod3"]
[null,"Wok","2010-07-25","Hunter",3,38.67,"Prod3"]
[null,"Lip","2010-06-12","Carter",6,63.77,"Prod3"]
[null,"Wok","2009-10-26","Jones",4,21.46,"Prod3"]
[null,"Jom","2009-07-30","Crawford",1,15.78,"Prod3"]
[null,"Wok","2009-03-26","Freeman",2,37.58,"Prod3"]
[null,"Tik","2010-04-01","Smith",2,43.11,"Prod3"]
[null,"Lip","2010-06-13","Smith",2,87.38,"Prod3"]
[null,"Wok","2009-11-08","Jones",3,14.24,"Prod3"]
[null,"Tik","2009-03-19","Freeman",2,66.180000000000007,"Prod3"]
[null,"Wok","2009-08-23","Freeman",3,36.65,"Prod3"]
[null,"Tik","2010-04-04","Russell",9,48.7,"Prod3"]
[null,"Jom","2010-07-06","Nelson",5,63.29,"Prod3"]
[null,"Wok","2009-07-23","Hunter",3,30.68,"Prod3"]
[null,"Tik","2009-10-13","Hill",2,78.510000000000005,"Prod3"]
[null,"Jom","2009-03-10","Hunter",8,61.51,"Prod3"]
[null,"Tik","2009-11-03","Porter",1,85.2,"Prod3"]
[null,"Tik","2010-02-03","Hunter",9,81.739999999999995,"Prod3"]
[null,"Lip","2010-06-20","Freeman",9,84.64,"Prod3"]
[null,"Wok","2010-06-13","Porter",6,29.94,"Prod3"]
[null,"Lip","2009-12-16","Freeman",8,26.19,"Prod3"]
[null,"Lip","2010-05-02","Crawford",7,29.19,"Prod3"]
[null,"Wok","2009-12-05","Smith",10,44.35,"Prod3"]
[null,"Hop","2009-09-13","Freeman",2,96.6,"Prod3"]
[null,"Hop","2010-08-11","Freeman",7,14.07,"Prod3"]
[null,"Hop","2009-10-01","Hunter",1,85.23,"Prod3"]